Reaction Details
TargetDynamin-1
LigandBDBM50147572
Substrate/Competitorn/a
Meas. Tech.ChEBML_60874
IC50 8850.0±n/a nM
Citation Hill, TAOdell, LRQuan, AAbagyan, RFerguson, GRobinson, PJMcCluskey, A Long chain amines and long chain ammonium salts as novel inhibitors of dynamin GTPase activity. Bioorg Med Chem Lett14:3275-8 (2004) 
 
Dynamin-1
Name:Dynamin-1
Type:PROTEIN
Mol. Mass.:97411.67
Organism:Homo sapiens (Human)
Description:ChEMBL_1458576
Residue:864
BDBM50147572
NameBDBM50147572
Synonyms:CHEMBL321384 | Tridecanoic acid (2-dimethylamino-ethyl)-amide
TypeSmall organic molecule
Emp. Form.C17H36N2O
Mol. Mass.284.4805
SMILESCCCCCCCCCCCCC(=O)NCCN(C)C