Reaction Details
TargetAdenosine receptor A2a
LigandBDBM50147637
Substrate/Competitorn/a
Meas. Tech.ChEBML_31364
Ki 27±n/a nM
Citation Guba, WNettekoven, MPüllmann, BRiemer, CSchmitt, S Comparison of inhibitory activity of isomeric triazolopyridine derivatives towards adenosine receptor subtypes or do similar structures reveal similar bioactivities? Bioorg Med Chem Lett14:3307-12 (2004) 
 
Adenosine receptor A2a
Name:Adenosine receptor A2a
Type:G Protein-Coupled Receptor (GPCR)
Mol. Mass.:44716.46
Organism:Homo sapiens (Human)
Description:P29274
Residue:412
BDBM50147637
NameBDBM50147637
Synonyms:(5-Amino-2-furan-2-yl-[1,2,4]triazolo[1,5-a]pyridin-7-yl)-piperidin-1-yl-methanone | CHEMBL109845
TypeSmall organic molecule
Emp. Form.C16H17N5O2
Mol. Mass.311.3385
SMILESNc1cc(cc2nc(nn12)-c1ccco1)C(=O)N1CCCCC1