Reaction Details
TargetAdenosine receptor A2a
LigandBDBM50147642
Substrate/Competitorn/a
Meas. Tech.ChEBML_31364
Ki 197±n/a nM
Citation Guba, WNettekoven, MPüllmann, BRiemer, CSchmitt, S Comparison of inhibitory activity of isomeric triazolopyridine derivatives towards adenosine receptor subtypes or do similar structures reveal similar bioactivities? Bioorg Med Chem Lett14:3307-12 (2004) 
 
Adenosine receptor A2a
Name:Adenosine receptor A2a
Type:G Protein-Coupled Receptor (GPCR)
Mol. Mass.:44716.46
Organism:Homo sapiens (Human)
Description:P29274
Residue:412
BDBM50147642
NameBDBM50147642
Synonyms:(8-Amino-2-thiophen-2-yl-[1,2,4]triazolo[1,5-a]pyridin-6-yl)-pyrrolidin-1-yl-methanone | CHEMBL433162
TypeSmall organic molecule
Emp. Form.C15H15N5OS
Mol. Mass.313.378
SMILESNc1cc(cn2nc(nc12)-c1cccs1)C(=O)N1CCCC1