Reaction Details
TargetAdenosine receptor A2a
LigandBDBM50147653
Substrate/Competitorn/a
Meas. Tech.ChEBML_31364
Ki 73±n/a nM
Citation Guba, WNettekoven, MPüllmann, BRiemer, CSchmitt, S Comparison of inhibitory activity of isomeric triazolopyridine derivatives towards adenosine receptor subtypes or do similar structures reveal similar bioactivities? Bioorg Med Chem Lett14:3307-12 (2004) 
 
Adenosine receptor A2a
Name:Adenosine receptor A2a
Type:G Protein-Coupled Receptor (GPCR)
Mol. Mass.:44716.46
Organism:Homo sapiens (Human)
Description:P29274
Residue:412
BDBM50147653
NameBDBM50147653
Synonyms:CHEMBL323754 | [8-Amino-2-(5-bromo-furan-2-yl)-[1,2,4]triazolo[1,5-a]pyridin-6-yl]-thiomorpholin-4-yl-methanone
TypeSmall organic molecule
Emp. Form.C15H14BrN5O2S
Mol. Mass.408.273
SMILESNc1cc(cn2nc(nc12)-c1ccc(Br)o1)C(=O)N1CCSCC1