Reaction Details
TargetAdenosine receptor A2a
LigandBDBM50147663
Substrate/Competitorn/a
Meas. Tech.ChEBML_31364
Ki 12±n/a nM
Citation Guba, WNettekoven, MPüllmann, BRiemer, CSchmitt, S Comparison of inhibitory activity of isomeric triazolopyridine derivatives towards adenosine receptor subtypes or do similar structures reveal similar bioactivities? Bioorg Med Chem Lett14:3307-12 (2004) 
 
Adenosine receptor A2a
Name:Adenosine receptor A2a
Type:G Protein-Coupled Receptor (GPCR)
Mol. Mass.:44716.46
Organism:Homo sapiens (Human)
Description:P29274
Residue:412
BDBM50147663
NameBDBM50147663
Synonyms:CHEMBL320349 | [5-Amino-2-(5-bromo-furan-2-yl)-[1,2,4]triazolo[1,5-a]pyridin-7-yl]-((S)-2-methoxymethyl-pyrrolidin-1-yl)-methanone
TypeSmall organic molecule
Emp. Form.C17H18BrN5O3
Mol. Mass.420.261
SMILESCOC[C@@H]1CCCN1C(=O)c1cc(N)n2nc(nc2c1)-c1ccc(Br)o1