Reaction Details
TargetSphingosine 1-phosphate receptor 3
LigandBDBM50147703
Substrate/Competitorn/a
Meas. Tech.ChEMBL_201334 (CHEMBL806183)
IC50 85±n/a nM
Citation Hale, JJNeway, WMills, SGHajdu, RAnn Keohane, CRosenbach, MMilligan, JShei, GJChrebet, GBergstrom, JCard, DKoo, GCKoprak, SLJackson, JJRosen, HMandala, S Potent S1P receptor agonists replicate the pharmacologic actions of the novel immune modulator FTY720. Bioorg Med Chem Lett14:3351-5 (2004) 
 
Sphingosine 1-phosphate receptor 3
Name:Sphingosine 1-phosphate receptor 3
Type:G Protein-Coupled Receptor (GPCR)
Mol. Mass.:42278.13
Organism:Homo sapiens (Human)
Description:Q99500
Residue:378
BDBM50147703
NameBDBM50147703
Synonyms:CHEMBL115554 [(1S,3R)-3-Amino-1-hydroxy-5-(4-octyl-phenyl)-pentyl]-phosphonic acid
TypeSmall organic molecule
Emp. Form.C19H34NO4P
Mol. Mass.371.4513
SMILESCCCCCCCCc1ccc(CC[C@@H](N)CC(=O)P(O)(O)O)cc1