Reaction Details
TargetNociceptin receptor
LigandBDBM50409823
Substrate/Competitorn/a
Meas. Tech.ChEMBL_144653 (CHEMBL752667)
EC50>10000±n/a nM
Citation Zaveri, NTJiang, FOlsen, CMDeschamps, JRParrish, DPolgar, WToll, L A novel series of piperidin-4-yl-1,3-dihydroindol-2-ones as agonist and antagonist ligands at the nociceptin receptor. J Med Chem47:2973-6 (2004) 
 
Nociceptin receptor
Name:Nociceptin receptor
Type:G Protein-Coupled Receptor (GPCR)
Mol. Mass.:40702.87
Organism:Homo sapiens (Human)
Description:P41146
Residue:370
BDBM50409823
NameBDBM50409823
Synonyms:CHEMBL2112407
TypeSmall organic molecule
Emp. Form.C21H28N2O
Mol. Mass.324.4598
SMILESO=C1Cc2ccccc2N1C1CCN(C[C@H]2CC3CCC2C3)CC1