Reaction Details
TargetMu-type opioid receptor
LigandBDBM50409823
Substrate/Competitorn/a
Meas. Tech.ChEMBL_148097 (CHEMBL751579)
Ki 115±n/a nM
Citation Zaveri, NTJiang, FOlsen, CMDeschamps, JRParrish, DPolgar, WToll, L A novel series of piperidin-4-yl-1,3-dihydroindol-2-ones as agonist and antagonist ligands at the nociceptin receptor. J Med Chem47:2973-6 (2004) 
 
Mu-type opioid receptor
Name:Mu-type opioid receptor
Type:G Protein-Coupled Receptor (GPCR)
Mol. Mass.:44789.51
Organism:Homo sapiens (Human)
Description:P35372
Residue:400
BDBM50409823
NameBDBM50409823
Synonyms:CHEMBL2112407
TypeSmall organic molecule
Emp. Form.C21H28N2O
Mol. Mass.324.4598
SMILESO=C1Cc2ccccc2N1C1CCN(C[C@H]2CC3CCC2C3)CC1