Reaction Details
TargetNociceptin receptor
LigandBDBM50147740
Substrate/Competitorn/a
Meas. Tech.ChEMBL_144653 (CHEMBL752667)
EC50 20±n/a nM
Citation Zaveri, NTJiang, FOlsen, CMDeschamps, JRParrish, DPolgar, WToll, L A novel series of piperidin-4-yl-1,3-dihydroindol-2-ones as agonist and antagonist ligands at the nociceptin receptor. J Med Chem47:2973-6 (2004) 
 
Nociceptin receptor
Name:Nociceptin receptor
Type:G Protein-Coupled Receptor (GPCR)
Mol. Mass.:40702.87
Organism:Homo sapiens (Human)
Description:P41146
Residue:370
BDBM50147740
NameBDBM50147740
Synonyms:1-(1-Cyclooctyl-piperidin-4-yl)-1,3-dihydro-indol-2-one | CHEMBL101454
TypeSmall organic molecule
Emp. Form.C21H30N2O
Mol. Mass.326.4757
SMILESO=C1Cc2ccccc2N1C1CCN(CC1)C1CCCCCCC1