Reaction Details
TargetNociceptin receptor
LigandBDBM50147737
Substrate/Competitorn/a
Meas. Tech.ChEMBL_144654 (CHEMBL752668)
Ki>10000±n/a nM
Citation Zaveri, NTJiang, FOlsen, CMDeschamps, JRParrish, DPolgar, WToll, L A novel series of piperidin-4-yl-1,3-dihydroindol-2-ones as agonist and antagonist ligands at the nociceptin receptor. J Med Chem47:2973-6 (2004) 
 
Nociceptin receptor
Name:Nociceptin receptor
Type:G Protein-Coupled Receptor (GPCR)
Mol. Mass.:40702.87
Organism:Homo sapiens (Human)
Description:P41146
Residue:370
BDBM50147737
NameBDBM50147737
Synonyms:1-(1-Dicyclohexylmethyl-piperidin-4-yl)-1,3-dihydro-indol-2-one | CHEMBL100574
TypeSmall organic molecule
Emp. Form.C26H38N2O
Mol. Mass.394.5927
SMILESO=C1Cc2ccccc2N1C1CCN(CC1)C(C1CCCCC1)C1CCCCC1