Reaction Details
TargetNociceptin receptor
LigandBDBM50147743
Substrate/Competitorn/a
Meas. Tech.ChEMBL_144654 (CHEMBL752668)
Ki 7.5±n/a nM
Citation Zaveri, NTJiang, FOlsen, CMDeschamps, JRParrish, DPolgar, WToll, L A novel series of piperidin-4-yl-1,3-dihydroindol-2-ones as agonist and antagonist ligands at the nociceptin receptor. J Med Chem47:2973-6 (2004) 
 
Nociceptin receptor
Name:Nociceptin receptor
Type:G Protein-Coupled Receptor (GPCR)
Mol. Mass.:40702.87
Organism:Homo sapiens (Human)
Description:P41146
Residue:370
BDBM50147743
NameBDBM50147743
Synonyms:1-(1-Bicyclo[3.3.1]non-9-yl-piperidin-4-yl)-1,3-dihydro-indol-2-one | CHEMBL102900
TypeSmall organic molecule
Emp. Form.C22H30N2O
Mol. Mass.338.4864
SMILESO=C1Cc2ccccc2N1C1CCN(CC1)C1C2CCCC1CCC2