Reaction Details
TargetNociceptin receptor
LigandBDBM50147738
Substrate/Competitorn/a
Meas. Tech.ChEMBL_144653 (CHEMBL752667)
EC50 93±n/a nM
Citation Zaveri, NTJiang, FOlsen, CMDeschamps, JRParrish, DPolgar, WToll, L A novel series of piperidin-4-yl-1,3-dihydroindol-2-ones as agonist and antagonist ligands at the nociceptin receptor. J Med Chem47:2973-6 (2004) 
 
Nociceptin receptor
Name:Nociceptin receptor
Type:G Protein-Coupled Receptor (GPCR)
Mol. Mass.:40702.87
Organism:Homo sapiens (Human)
Description:P41146
Residue:370
BDBM50147738
NameBDBM50147738
Synonyms:1-[1-(1,2,3,4-Tetrahydro-naphthalen-2-yl)-piperidin-4-yl]-1,3-dihydro-indol-2-one | CHEMBL101676
TypeSmall organic molecule
Emp. Form.C23H26N2O
Mol. Mass.346.4653
SMILESO=C1Cc2ccccc2N1C1CCN(CC1)C1CCc2ccccc2C1