Reaction Details
TargetNociceptin receptor
LigandBDBM50147748
Substrate/Competitorn/a
Meas. Tech.ChEMBL_144653 (CHEMBL752667)
EC50>10000±n/a nM
Citation Zaveri, NTJiang, FOlsen, CMDeschamps, JRParrish, DPolgar, WToll, L A novel series of piperidin-4-yl-1,3-dihydroindol-2-ones as agonist and antagonist ligands at the nociceptin receptor. J Med Chem47:2973-6 (2004) 
 
Nociceptin receptor
Name:Nociceptin receptor
Type:G Protein-Coupled Receptor (GPCR)
Mol. Mass.:40702.87
Organism:Homo sapiens (Human)
Description:P41146
Residue:370
BDBM50147748
NameBDBM50147748
Synonyms:1-{1-[1-(9H-Fluoren-2-yl)-ethyl]-piperidin-4-yl}-1,3-dihydro-indol-2-one | CHEMBL328411
TypeSmall organic molecule
Emp. Form.C28H28N2O
Mol. Mass.408.5347
SMILESCC(N1CCC(CC1)N1C(=O)Cc2ccccc12)c1ccc-2c(Cc3ccccc-23)c1