Reaction Details
TargetKappa-type opioid receptor
LigandBDBM50147749
Substrate/Competitorn/a
Meas. Tech.ChEMBL_145241 (CHEMBL755692)
Ki 229±n/a nM
Citation Zaveri, NTJiang, FOlsen, CMDeschamps, JRParrish, DPolgar, WToll, L A novel series of piperidin-4-yl-1,3-dihydroindol-2-ones as agonist and antagonist ligands at the nociceptin receptor. J Med Chem47:2973-6 (2004) 
 
Kappa-type opioid receptor
Name:Kappa-type opioid receptor
Type:G Protein-Coupled Receptor (GPCR)
Mol. Mass.:42648.76
Organism:Homo sapiens (Human)
Description:P41145
Residue:380
BDBM50147749
NameBDBM50147749
Synonyms:1-(1-Cyclooctylmethyl-piperidin-4-yl)-1,3-dihydro-indol-2-one | CHEMBL317152
TypeSmall organic molecule
Emp. Form.C22H32N2O
Mol. Mass.340.5023
SMILESO=C1Cc2ccccc2N1C1CCN(CC2CCCCCCC2)CC1