Reaction Details
TargetKappa-type opioid receptor
LigandBDBM50147745
Substrate/Competitorn/a
Meas. Tech.ChEMBL_145241 (CHEMBL755692)
Ki 369±n/a nM
Citation Zaveri, NTJiang, FOlsen, CMDeschamps, JRParrish, DPolgar, WToll, L A novel series of piperidin-4-yl-1,3-dihydroindol-2-ones as agonist and antagonist ligands at the nociceptin receptor. J Med Chem47:2973-6 (2004) 
 
Kappa-type opioid receptor
Name:Kappa-type opioid receptor
Type:G Protein-Coupled Receptor (GPCR)
Mol. Mass.:42648.76
Organism:Homo sapiens (Human)
Description:P41145
Residue:380
BDBM50147745
NameBDBM50147745
Synonyms:1-[1-(4-Isopropyl-cyclohexyl)-piperidin-4-yl]-1,3-dihydro-indol-2-one | CHEMBL99738
TypeSmall organic molecule
Emp. Form.C22H32N2O
Mol. Mass.340.5023
SMILESCC(C)[C@H]1CC[C@@H](CC1)N1CCC(CC1)N1C(=O)Cc2ccccc12