Reaction Details
TargetAdenosine receptor A1
LigandBDBM50090705
Substrate/Competitorn/a
Meas. Tech.ChEMBL_29112 (CHEMBL638724)
Ki 5.3±n/a nM
Citation Ferrarini, PLBetti, LCavallini, TGiannaccini, GLucacchini, AManera, CMartinelli, AOrtore, GSaccomanni, GTuccinardi, T Study on affinity profile toward native human and bovine adenosine receptors of a series of 1,8-naphthyridine derivatives. J Med Chem47:3019-31 (2004) 
 
Adenosine receptor A1
Name:Adenosine receptor A1
Type:Enzyme Catalytic Domain
Mol. Mass.:36602.99
Organism:BOVINE
Description:ADENOSINE 0 BOVINE::P28190
Residue:326
BDBM50090705
NameBDBM50090705
Synonyms:7-Methyl-2-phenyl-[1,8]naphthyridin-4-ol CHEMBL97549
TypeSmall organic molecule
Emp. Form.C15H12N2O
Mol. Mass.236.2686
SMILESCc1ccc2c(O)cc(nc2n1)-c1ccccc1