Reaction Details
TargetAdenosine receptor A2a
LigandBDBM50090700
Substrate/Competitorn/a
Meas. Tech.ChEMBL_27616 (CHEMBL639492)
Ki 66±n/a nM
Citation Ferrarini, PLBetti, LCavallini, TGiannaccini, GLucacchini, AManera, CMartinelli, AOrtore, GSaccomanni, GTuccinardi, T Study on affinity profile toward native human and bovine adenosine receptors of a series of 1,8-naphthyridine derivatives. J Med Chem47:3019-31 (2004) 
 
Adenosine receptor A2a
Name:Adenosine receptor A2a
Type:G Protein-Coupled Receptor (GPCR)
Mol. Mass.:44716.46
Organism:Homo sapiens (Human)
Description:P29274
Residue:412
BDBM50090700
NameBDBM50090700
Synonyms:7-Bromo-2-phenyl-[1,8]naphthyridin-4-ol CHEMBL97687
TypeSmall organic molecule
Emp. Form.C14H9BrN2O
Mol. Mass.301.138
SMILESOc1cc(nc2nc(Br)ccc12)-c1ccccc1