Reaction Details
TargetDelta-type opioid receptor
LigandBDBM50148076
Substrate/Competitorn/a
Meas. Tech.ChEMBL_145307 (CHEMBL752842)
EC50 7.9±n/a nM
Citation Spetea, MSchüllner, FMoisa, RCBerzetei-Gurske, IPSchraml, BDörfler, CAceto, MDHarris, LSCoop, ASchmidhammer, H Synthesis and biological evaluation of 14-alkoxymorphinans. 21. Novel 4-alkoxy and 14-phenylpropoxy derivatives of the mu opioid receptor antagonist cyprodime. J Med Chem47:3242-7 (2004) 
 
Delta-type opioid receptor
Name:Delta-type opioid receptor
Type:G Protein-Coupled Receptor (GPCR)
Mol. Mass.:40382.98
Organism:Homo sapiens (Human)
Description:Competition binding assays were carried out using membrane preparations from transfected HN9.10 cells that constitutively expressed the delta opioid receptor.
Residue:372
BDBM50148076
NameBDBM50148076
Synonyms:17-cyclopropylmethyl-3-hydroxy-10-(3-phenylpropoxy)-(1R,9R,10S)-17-azatetracyclo[7.5.3.01,10.02,7]heptadeca-2(7),3,5-trien-13-one | CHEMBL325347
TypeSmall organic molecule
Emp. Form.C29H35NO3
Mol. Mass.445.5931
SMILESOc1cccc2C[C@H]3N(CC4CC4)CCC4(CC(=O)CC[C@@]34OCCCc3ccccc3)c12