Reaction Details
TargetDelta-type opioid receptor
LigandBDBM50148078
Substrate/Competitorn/a
Meas. Tech.ChEMBL_147033 (CHEMBL753674)
Ki 841000±n/a nM
Citation Spetea, MSchüllner, FMoisa, RCBerzetei-Gurske, IPSchraml, BDörfler, CAceto, MDHarris, LSCoop, ASchmidhammer, H Synthesis and biological evaluation of 14-alkoxymorphinans. 21. Novel 4-alkoxy and 14-phenylpropoxy derivatives of the mu opioid receptor antagonist cyprodime. J Med Chem47:3242-7 (2004) 
 
Delta-type opioid receptor
Name:Delta-type opioid receptor
Type:G Protein-Coupled Receptor (GPCR)
Mol. Mass.:40465.04
Organism:Rattus norvegicus (rat)
Description:Competition binding assays were using CHO-K1 cell membranes expressing the opioid receptor.
Residue:372
BDBM50148078
NameBDBM50148078
Synonyms:17-cyclopropylmethyl-10-methoxy-13-oxo-(1R,9R,10S)-17-azatetracyclo[7.5.3.01,10.02,7]heptadeca-2(7),3,5-trien-3-yl 3-phenyl-(E)-2-propenoate | CHEMBL109786
TypeSmall organic molecule
Emp. Form.C30H33NO4
Mol. Mass.471.5873
SMILESCO[C@@]12CCC(=O)CC11CCN(CC3CC3)[C@@H]2Cc2cccc(OC(=O)\C=C\c3ccccc3)c12