Reaction Details
TargetDelta-type opioid receptor
LigandBDBM50148071
Substrate/Competitorn/a
Meas. Tech.ChEMBL_147033 (CHEMBL753674)
Ki 414000±n/a nM
Citation Spetea, MSchüllner, FMoisa, RCBerzetei-Gurske, IPSchraml, BDörfler, CAceto, MDHarris, LSCoop, ASchmidhammer, H Synthesis and biological evaluation of 14-alkoxymorphinans. 21. Novel 4-alkoxy and 14-phenylpropoxy derivatives of the mu opioid receptor antagonist cyprodime. J Med Chem47:3242-7 (2004) 
 
Delta-type opioid receptor
Name:Delta-type opioid receptor
Type:G Protein-Coupled Receptor (GPCR)
Mol. Mass.:40465.04
Organism:Rattus norvegicus (rat)
Description:Competition binding assays were using CHO-K1 cell membranes expressing the opioid receptor.
Residue:372
BDBM50148071
NameBDBM50148071
Synonyms:(-)-N-(Cycloproylmethyl)-4,14-dimethoxymorphinan-6-one(Cyprodime) 17-cyclopropylmethyl-3,10-dimethoxy-(1R,9R,10S)-17-azatetracyclo[7.5.3.01,10.02,7]heptadeca-2(7),3,5-trien-13-one CYPRODIME BROMIDE cyprodime
TypeSmall organic molecule
Emp. Form.C22H29NO3
Mol. Mass.355.4706
SMILESCOc1cccc2C[C@H]3N(CC4CC4)CC[C@@]4(CC(=O)CC[C@@]34OC)c12