Reaction Details
TargetKappa-type opioid receptor
LigandBDBM50148072
Substrate/Competitorn/a
Meas. Tech.ChEMBL_145819 (CHEMBL753530)
Ki 22800±n/a nM
Citation Spetea, MSchüllner, FMoisa, RCBerzetei-Gurske, IPSchraml, BDörfler, CAceto, MDHarris, LSCoop, ASchmidhammer, H Synthesis and biological evaluation of 14-alkoxymorphinans. 21. Novel 4-alkoxy and 14-phenylpropoxy derivatives of the mu opioid receptor antagonist cyprodime. J Med Chem47:3242-7 (2004) 
 
Kappa-type opioid receptor
Name:Kappa-type opioid receptor
Type:G Protein-Coupled Receptor (GPCR)
Mol. Mass.:42692.90
Organism:Rattus norvegicus (rat)
Description:P34975
Residue:380
BDBM50148072
NameBDBM50148072
Synonyms:4-cyclopropylmethyl-17-(3-phenylpropoxy)-(1S,5R,17S)-12-oxa-4-azapentacyclo[9.6.1.01,13.05,17.07,18]octadeca-7(18),8,10-trien-14-one | CHEMBL321170
TypeSmall organic molecule
Emp. Form.C29H33NO3
Mol. Mass.443.5772
SMILESO=C1CC[C@@]2(OCCCc3ccccc3)[C@H]3Cc4cccc5OC1C2(CCN3CC1CC1)c45