Reaction Details
TargetMu-type opioid receptor
LigandBDBM50148072
Substrate/Competitorn/a
Meas. Tech.ChEMBL_148988 (CHEMBL754204)
Ki 840.0±n/a nM
Citation Spetea, MSchüllner, FMoisa, RCBerzetei-Gurske, IPSchraml, BDörfler, CAceto, MDHarris, LSCoop, ASchmidhammer, H Synthesis and biological evaluation of 14-alkoxymorphinans. 21. Novel 4-alkoxy and 14-phenylpropoxy derivatives of the mu opioid receptor antagonist cyprodime. J Med Chem47:3242-7 (2004) 
 
Mu-type opioid receptor
Name:Mu-type opioid receptor
Type:G Protein-Coupled Receptor (GPCR)
Mol. Mass.:44503.11
Organism:Rattus norvegicus (rat)
Description:Competition binding assays were carried out using membrane preparations from transfected HN9.10 cells that constitutively expressed the mu opioid receptor.
Residue:398
BDBM50148072
NameBDBM50148072
Synonyms:4-cyclopropylmethyl-17-(3-phenylpropoxy)-(1S,5R,17S)-12-oxa-4-azapentacyclo[9.6.1.01,13.05,17.07,18]octadeca-7(18),8,10-trien-14-one | CHEMBL321170
TypeSmall organic molecule
Emp. Form.C29H33NO3
Mol. Mass.443.5772
SMILESO=C1CC[C@@]2(OCCCc3ccccc3)[C@H]3Cc4cccc5OC1C2(CCN3CC1CC1)c45