Reaction Details
TargetMu-type opioid receptor
LigandBDBM50148073
Substrate/Competitorn/a
Meas. Tech.ChEMBL_145579 (CHEMBL749655)
EC50 2±n/a nM
Citation Spetea, MSchüllner, FMoisa, RCBerzetei-Gurske, IPSchraml, BDörfler, CAceto, MDHarris, LSCoop, ASchmidhammer, H Synthesis and biological evaluation of 14-alkoxymorphinans. 21. Novel 4-alkoxy and 14-phenylpropoxy derivatives of the mu opioid receptor antagonist cyprodime. J Med Chem47:3242-7 (2004) 
 
Mu-type opioid receptor
Name:Mu-type opioid receptor
Type:G Protein-Coupled Receptor (GPCR)
Mol. Mass.:44789.51
Organism:Homo sapiens (Human)
Description:P35372
Residue:400
BDBM50148073
NameBDBM50148073
Synonyms:17-cyclopropylmethyl-3-methoxy-10-(3-phenylpropoxy)-(1R,9R,10S)-17-azatetracyclo[7.5.3.01,10.02,7]heptadeca-2(7),3,5-trien-13-one | CHEMBL110640
TypeSmall organic molecule
Emp. Form.C30H37NO3
Mol. Mass.459.6197
SMILESCOc1cccc2C[C@H]3N(CC4CC4)CCC4(CC(=O)CC[C@@]34OCCCc3ccccc3)c12