Reaction Details
TargetNitric oxide synthase, inducible
LigandBDBM50091817
Substrate/Competitorn/a
Meas. Tech.ChEMBL_89199 (CHEMBL701150)
IC50 10±n/a nM
Citation Connolly, SAberg, AArvai, ABeaton, HGCheshire, DRCook, ARCooper, SCox, DHamley, PMallinder, PMillichip, INicholls, DJRosenfeld, RJSt-Gallay, SATainer, JTinker, ACWallace, AV 2-aminopyridines as highly selective inducible nitric oxide synthase inhibitors. Differential binding modes dependent on nitrogen substitution. J Med Chem47:3320-3 (2004) 
 
Nitric oxide synthase, inducible
Name:Nitric oxide synthase, inducible
Type:Homodimer
Mol. Mass.:131141.95
Organism:Homo sapiens (Human)
Description:P35228
Residue:1153
BDBM50091817
NameBDBM50091817
Synonyms:4-Methyl-6-propyl-pyridin-2-ylamine 4-methyl-6-propylpyridin-2-amine | CHEMBL302657
TypeSmall organic molecule
Emp. Form.C9H14N2
Mol. Mass.150.2209
SMILESCCCc1cc(C)cc(N)n1