Reaction Details
TargetGamma-aminobutyric acid receptor subunit alpha-1/beta-3/gamma-2
LigandBDBM50148331
Substrate/Competitorn/a
Meas. Tech.ChEMBL_219124 (CHEMBL821804)
Ki 0.380000±n/a nM
Citation Mitchinson, AAtack, JRBlurton, PCarling, RWCastro, JLCurley, KSRussell, MGMarshall, GMcKernan, RMMoore, KWNarquizian, RSmith, AStreet, LJThompson, SAWafford, K 2,5-Dihydropyrazolo[4,3-c]pyridin-3-ones: functionally selective benzodiazepine binding site ligands on the GABAA receptor. Bioorg Med Chem Lett14:3441-4 (2004) 
 
Gamma-aminobutyric acid receptor subunit alpha-1/beta-3/gamma-2
Name:Gamma-aminobutyric acid receptor subunit alpha-1/beta-3/gamma-2
Type:Protein
Mol. Mass.:n/a
Description:n/a
Components:This complex has 3 components.
Component 1
Name:Gamma-aminobutyric acid receptor subunit alpha-1
Synonyms:Benzodiazepine central GABA A Benzodiazepine liver GABA(A) receptor subunit alpha-1 GABA-A receptor GBRA1_HUMAN TBPS | agonist GABA site
Type:Protein
Mol. Mass.:51817.35
Organism:Homo sapiens (Human)
Description:P14867
Residue:456
Component 2
Name:Gamma-aminobutyric acid receptor subunit beta-3
Synonyms:GABA A receptor alpha-4/beta-3/gamma-2 GABA-A receptor GBRB3_HUMAN | agonist GABA site
Type:PROTEIN
Mol. Mass.:54130.51
Organism:Homo sapiens (Human)
Description:ChEMBL_448071
Residue:473
Component 3
Name:Gamma-aminobutyric acid receptor subunit gamma-2
Synonyms:GABA(A) receptor subunit gamma-2 GBRG2_HUMAN
Type:PROTEIN
Mol. Mass.:54172.74
Organism:Homo sapiens (Human)
Description:EBI_217
Residue:467
BDBM50148331
NameBDBM50148331
Synonyms:2-(4-Difluoromethoxy-phenyl)-5,5a,6,7,9,9a-hexahydro-2H-8-thia-1,2,5-triaza-cyclopenta[a]naphthalen-3-one | CHEMBL423690
TypeSmall organic molecule
Emp. Form.C16H15F2N3O2S
Mol. Mass.351.371
SMILESFC(F)Oc1ccc(cc1)-n1[nH]c2C3CSCCC3N=Cc2c1=O