Reaction Details
TargetLysophosphatidic acid receptor 3
LigandBDBM50074700
Substrate/Competitorn/a
Meas. Tech.ChEBML_100180
EC50>5000±n/a nM
Citation Santos, WLHeasley, BHJarosz, RCarter, KMLynch, KRMacdonald, TL Synthesis and biological evaluation of phosphonic and thiophosphoric acid derivatives of lysophosphatidic acid. Bioorg Med Chem Lett14:3473-6 (2004) 
 
Lysophosphatidic acid receptor 3
Name:Lysophosphatidic acid receptor 3
Type:Enzyme
Mol. Mass.:40149.72
Organism:Homo sapiens (Human)
Description:Q9UBY5
Residue:353
BDBM50074700
NameBDBM50074700
Synonyms:CHEMBL117754 | Phosphoric acid mono-[2-((Z)-octadec-9-enoylamino)-ethyl] ester
TypeSmall organic molecule
Emp. Form.C20H40NO5P
Mol. Mass.405.5091
SMILESCCCCCCCC\C=C/CCCCCCCC(=O)NCCOP(O)(O)=O