Reaction Details
TargetSodium-dependent noradrenaline transporter
LigandBDBM84745
Substrate/Competitorn/a
Meas. Tech.ChEMBL_142807 (CHEMBL882765)
Ki 7.45±n/a nM
Citation Kuo, FGillespie, TAKulanthaivel, PLantz, RJMa, TWNelson, DLThrelkeld, PGWheeler, WJYi, PZmijewski, M Synthesis and biological activity of some known and putative duloxetine metabolites. Bioorg Med Chem Lett14:3481-6 (2004) 
 
Sodium-dependent noradrenaline transporter
Name:Sodium-dependent noradrenaline transporter
Type:Multi-pass membrane protein
Mol. Mass.:69337.72
Organism:Homo sapiens (Human)
Description:P23975
Residue:617
BDBM84745
NameBDBM84745
Synonyms:CAS_136434-34-9 LY-248686 USRE49340, Rank 5
TypeSmall organic molecule
Emp. Form.C18H19NOS
Mol. Mass.297.415
SMILESCNCC[C@H](Oc1cccc2ccccc12)c1cccs1