Reaction Details
TargetSphingosine 1-phosphate receptor 2
LigandBDBM50148439
Substrate/Competitorn/a
Meas. Tech.ChEMBL_201452 (CHEMBL807597)
IC50 10±n/a nM
Citation Hale, JJDoherty, GToth, LMills, SGHajdu, RKeohane, CARosenbach, MMilligan, JShei, GJChrebet, GBergstrom, JCard, DForrest, MSun, SYWest, SXie, HNomura, NRosen, HMandala, S Selecting against S1P3 enhances the acute cardiovascular tolerability of 3-(N-benzyl)aminopropylphosphonic acid S1P receptor agonists. Bioorg Med Chem Lett14:3501-5 (2004) 
 
Sphingosine 1-phosphate receptor 2
Name:Sphingosine 1-phosphate receptor 2
Type:G Protein-Coupled Receptor (GPCR)
Mol. Mass.:38883.16
Organism:Homo sapiens (Human)
Description:Membranes isolated from S1P2-transfected CHO cells were used in ligand binding assay.
Residue:353
BDBM50148439
NameBDBM50148439
Synonyms:3-(3-bromo-5-methoxy-4-(octyloxy)benzylamino)propylphosphonic acid [3-(3-Bromo-5-methoxy-4-octyloxy-benzylamino)-propyl]-phosphonic acid
TypeSmall organic molecule
Emp. Form.C19H33BrNO5P
Mol. Mass.466.347
SMILESCCCCCCCCOc1c(Br)cc(CNCCCP(O)(O)=O)cc1OC