Reaction Details
TargetSphingosine 1-phosphate receptor 1
LigandBDBM50148426
Substrate/Competitorn/a
Meas. Tech.ChEBML_201315
IC50 0.500000±n/a nM
Citation Hale, JJDoherty, GToth, LMills, SGHajdu, RKeohane, CARosenbach, MMilligan, JShei, GJChrebet, GBergstrom, JCard, DForrest, MSun, SYWest, SXie, HNomura, NRosen, HMandala, S Selecting against S1P3 enhances the acute cardiovascular tolerability of 3-(N-benzyl)aminopropylphosphonic acid S1P receptor agonists. Bioorg Med Chem Lett14:3501-5 (2004) 
 
Sphingosine 1-phosphate receptor 1
Name:Sphingosine 1-phosphate receptor 1
Type:Enzyme
Mol. Mass.:42836.02
Organism:Homo sapiens (Human)
Description:P21453
Residue:382
BDBM50148426
NameBDBM50148426
Synonyms:CHEMBL323617 | {3-[4-(5-Heptyl-[1,2,4]oxadiazol-3-yl)-benzylamino]-propyl}-phosphonic acid
TypeSmall organic molecule
Emp. Form.C19H30N3O4P
Mol. Mass.395.433
SMILESCCCCCCCc1nc(no1)-c1ccc(CNCCCP(O)(O)=O)cc1