Reaction Details
TargetSphingosine 1-phosphate receptor 1
LigandBDBM50148414
Substrate/Competitorn/a
Meas. Tech.ChEBML_201315
IC50 1.3±n/a nM
Citation Hale, JJDoherty, GToth, LMills, SGHajdu, RKeohane, CARosenbach, MMilligan, JShei, GJChrebet, GBergstrom, JCard, DForrest, MSun, SYWest, SXie, HNomura, NRosen, HMandala, S Selecting against S1P3 enhances the acute cardiovascular tolerability of 3-(N-benzyl)aminopropylphosphonic acid S1P receptor agonists. Bioorg Med Chem Lett14:3501-5 (2004) 
 
Sphingosine 1-phosphate receptor 1
Name:Sphingosine 1-phosphate receptor 1
Type:Enzyme
Mol. Mass.:42836.02
Organism:Homo sapiens (Human)
Description:P21453
Residue:382
BDBM50148414
NameBDBM50148414
Synonyms:CHEMBL332667 | [3-(3,5-Dibromo-4-octyloxy-benzylamino)-propyl]-phosphonic acid
TypeSmall organic molecule
Emp. Form.C18H30Br2NO4P
Mol. Mass.515.217
SMILESCCCCCCCCOc1c(Br)cc(CNCCCP(O)(O)=O)cc1Br