Reaction Details
TargetLysophosphatidic acid receptor 2
LigandBDBM50148429
Substrate/Competitorn/a
Meas. Tech.ChEBML_201449
IC50 450±n/a nM
Citation Hale, JJDoherty, GToth, LMills, SGHajdu, RKeohane, CARosenbach, MMilligan, JShei, GJChrebet, GBergstrom, JCard, DForrest, MSun, SYWest, SXie, HNomura, NRosen, HMandala, S Selecting against S1P3 enhances the acute cardiovascular tolerability of 3-(N-benzyl)aminopropylphosphonic acid S1P receptor agonists. Bioorg Med Chem Lett14:3501-5 (2004) 
 
Lysophosphatidic acid receptor 2
Name:Lysophosphatidic acid receptor 2
Type:PROTEIN
Mol. Mass.:39103.44
Organism:Homo sapiens (Human)
Description:ChEMBL_1451385
Residue:351
BDBM50148429
NameBDBM50148429
Synonyms:CHEMBL118508 | [3-(3-Methoxy-4-octyloxy-benzylamino)-propyl]-phosphonic acid
TypeSmall organic molecule
Emp. Form.C19H34NO5P
Mol. Mass.387.4507
SMILESCCCCCCCCOc1ccc(CNCCCP(O)(O)=O)cc1OC