Reaction Details
TargetBeta-3 adrenergic receptor
LigandBDBM50148492
Substrate/Competitorn/a
Meas. Tech.ChEBML_39051
Ki 950±n/a nM
Citation Washburn, WNSun, CQBisacchi, GWu, GCheng, PTSher, PMRyono, DGavai, AVPoss, KGirotra, RNMcCann, PJMikkilineni, ABDejneka, TCWang, TCMerchant, ZMorella, MArbeeny, CMHarper, TWSlusarchyk, DASkwish, SRussell, ADAllen, GTTesfamariam, BFrohlich, BHAbboa-Offei, BECap, MWaldron, TLGeorge, RJYoung, DDickinson, KESeymour, AA BMS-201620: a selective beta 3 agonist. Bioorg Med Chem Lett14:3525-9 (2004) 
 
Beta-3 adrenergic receptor
Name:Beta-3 adrenergic receptor
Type:G Protein-Coupled Receptor (GPCR)
Mol. Mass.:43534.88
Organism:Homo sapiens (Human)
Description:n/a
Residue:408
BDBM50148492
NameBDBM50148492
Synonyms:(S)-2-(4-Bromo-phenyl)-2-[2-hydroxy-2-((R)-4-hydroxy-3-methanesulfonylamino-phenyl)-ethylamino]-N-phenyl-propionamide | CHEMBL119875
TypeSmall organic molecule
Emp. Form.C24H26BrN3O5S
Mol. Mass.548.449
SMILESC[C@@](NC[C@H](O)c1ccc(O)c(NS(C)(=O)=O)c1)(C(=O)Nc1ccccc1)c1ccc(Br)cc1