Reaction Details
TargetBeta-3 adrenergic receptor
LigandBDBM50148493
Substrate/Competitorn/a
Meas. Tech.ChEBML_39051
Ki 44±n/a nM
Citation Washburn, WNSun, CQBisacchi, GWu, GCheng, PTSher, PMRyono, DGavai, AVPoss, KGirotra, RNMcCann, PJMikkilineni, ABDejneka, TCWang, TCMerchant, ZMorella, MArbeeny, CMHarper, TWSlusarchyk, DASkwish, SRussell, ADAllen, GTTesfamariam, BFrohlich, BHAbboa-Offei, BECap, MWaldron, TLGeorge, RJYoung, DDickinson, KESeymour, AA BMS-201620: a selective beta 3 agonist. Bioorg Med Chem Lett14:3525-9 (2004) 
 
Beta-3 adrenergic receptor
Name:Beta-3 adrenergic receptor
Type:G Protein-Coupled Receptor (GPCR)
Mol. Mass.:43534.88
Organism:Homo sapiens (Human)
Description:n/a
Residue:408
BDBM50148493
NameBDBM50148493
Synonyms:(R)-N-((R)-2-Hydroxy-5-{1-hydroxy-2-[(R)-1-(4-methoxy-phenyl)-2-phenyl-ethylamino]-ethyl}-phenyl)-methanesulfonamide | CHEMBL116715
TypeSmall organic molecule
Emp. Form.C24H28N2O5S
Mol. Mass.456.555
SMILESCOc1ccc(cc1)[C@@H](Cc1ccccc1)NC[C@H](O)c1ccc(O)c(NS(C)(=O)=O)c1