Reaction Details
TargetHistone deacetylase 1
LigandBDBM50148757
Substrate/Competitorn/a
Meas. Tech.ChEMBL_87855 (CHEMBL701994)
IC50 1±n/a nM
Citation Wang, DFWiest, OHelquist, PLan-Hargest, HYWiech, NL On the function of the 14 A long internal cavity of histone deacetylase-like protein: implications for the design of histone deacetylase inhibitors. J Med Chem47:3409-17 (2004) 
 
Histone deacetylase 1
Name:Histone deacetylase 1
Type:Enzyme
Mol. Mass.:55090.27
Organism:Homo sapiens (Human)
Description:Q13547
Residue:482
BDBM50148757
NameBDBM50148757
Synonyms:2-[3-(2-Hydroxycarbamoyl-vinyl)-phenyl]-N,N'-diphenyl-malonamide SK-683
TypeSmall organic molecule
Emp. Form.C24H21N3O4
Mol. Mass.415.4412
SMILESONC(=O)\C=C\c1cccc(c1)C(C(=O)Nc1ccccc1)C(=O)Nc1ccccc1