Reaction Details
TargetReverse transcriptase/RNaseH
LigandBDBM50011181
Substrate/Competitorn/a
Meas. Tech.ChEMBL_196374 (CHEMBL873105)
IC50 24000±n/a nM
Citation Velázquez, SLobatón, EDe Clercq, EKoontz, DLMellors, JWBalzarini, JCamarasa, MJ Hybrids of [TSAO-T]-[foscarnet]: The first conjugate of foscarnet with a non-nucleoside reverse transcriptase inhibitor through a labile covalent ester bond. J Med Chem47:3418-26 (2004) 
 
Reverse transcriptase/RNaseH
Name:Reverse transcriptase/RNaseH
Type:PROTEIN
Mol. Mass.:65229.15
Organism:Human immunodeficiency virus 1
Description:ChEMBL_1473730
Residue:566
BDBM50011181
NameBDBM50011181
Synonyms:(PFA)dihydroxyphosphinecarboxylic acid oxide FOSCARNET Foscarnet (PFA) Phosphono-formic acid(PFA) dihydroxyphosphinecarboxylic acid oxide phosphonoformic acid(PFA)
TypeSmall organic molecule
Emp. Form.CH3O5P
Mol. Mass.126.0053
SMILESOC(=O)P(O)(O)=O