Reaction Details
TargetCorticotropin-releasing factor receptor 1
LigandBDBM50148897
Substrate/Competitorn/a
Meas. Tech.ChEBML_51104
Ki 0.730000±n/a nM
Citation Chen, CWilcoxen, KMHuang, CQMcCarthy, JRChen, TGrigoriadis, DE Optimization of 3-phenylpyrazolo[1,5-a]pyrimidines as potent corticotropin-releasing factor-1 antagonists with adequate lipophilicity and water solubility. Bioorg Med Chem Lett14:3669-73 (2004) 
 
Corticotropin-releasing factor receptor 1
Name:Corticotropin-releasing factor receptor 1
Type:Enzyme
Mol. Mass.:50744.31
Organism:Homo sapiens (Human)
Description:P34998
Residue:444
BDBM50148897
NameBDBM50148897
Synonyms:CHEMBL333735 | Cyclopropylmethyl-[3-(2,4-dichloro-phenyl)-2-methyl-5-methylsulfanyl-3H-pyrazolo[1,5-a]pyrimidin-7-yl]-propyl-amine
TypeSmall organic molecule
Emp. Form.C21H24Cl2N4S
Mol. Mass.435.413
SMILESCCCN(CC1CC1)c1cc(SC)nc2c(c(C)nn12)-c1ccc(Cl)cc1Cl