Reaction Details
TargetCorticotropin-releasing factor receptor 1
LigandBDBM50071235
Substrate/Competitorn/a
Meas. Tech.ChEBML_51104
Ki 1.3±n/a nM
Citation Chen, CWilcoxen, KMHuang, CQMcCarthy, JRChen, TGrigoriadis, DE Optimization of 3-phenylpyrazolo[1,5-a]pyrimidines as potent corticotropin-releasing factor-1 antagonists with adequate lipophilicity and water solubility. Bioorg Med Chem Lett14:3669-73 (2004) 
 
Corticotropin-releasing factor receptor 1
Name:Corticotropin-releasing factor receptor 1
Type:Enzyme
Mol. Mass.:50744.31
Organism:Homo sapiens (Human)
Description:P34998
Residue:444
BDBM50071235
NameBDBM50071235
Synonyms:CHEMBL65078 Cyclopropylmethyl-[3-(2,4-dichloro-phenyl)-2,5-dimethyl-pyrazolo[1,5-a]pyrimidin-7-yl]-propyl-amine
TypeSmall organic molecule
Emp. Form.C21H24Cl2N4
Mol. Mass.403.348
SMILESCCCN(CC1CC1)c1cc(C)nc2c(c(C)nn12)-c1ccc(Cl)cc1Cl