Reaction Details
TargetCoagulation factor X
LigandBDBM50148952
Substrate/Competitorn/a
Meas. Tech.ChEBML_49141
Ki>10000±n/a nM
Citation Klingler, OMatter, HSchudok, MDonghi, MCzech, JLorenz, MNestler, HPSzillat, HSchreuder, H Structure-based design of amidinophenylurea-derivatives for factor VIIa inhibition. Bioorg Med Chem Lett14:3715-20 (2004) 
 
Coagulation factor X
Name:Coagulation factor X
Type:Enzyme
Mol. Mass.:54726.60
Organism:Homo sapiens (Human)
Description:n/a
Residue:488
BDBM50148952
NameBDBM50148952
Synonyms:CHEMBL429152 | N-[4-(1-{2-[3-(4-Carbamimidoyl-phenyl)-ureido]-acetylamino}-ethyl)-phenyl]-3-phenoxy-benzamide
TypeSmall organic molecule
Emp. Form.C31H30N6O4
Mol. Mass.550.6077
SMILESCC(NC(=O)CNC(=O)Nc1ccc(cc1)C(N)=N)c1ccc(NC(=O)c2cccc(Oc3ccccc3)c2)cc1