Reaction Details
TargetMelanocortin receptor 4
LigandBDBM50148979
Substrate/Competitorn/a
Meas. Tech.ChEBML_106507
Ki 2500±n/a nM
Citation Marsilje, THRoses, JBCalderwood, EFStroud, SGForsyth, NEBlackburn, CYowe, DLMiao, WDrabic, SVBohane, MDScott Daniels, JLi, PWu, LPatane, MAClaiborne, CF Synthesis and biological evaluation of imidazole-based small molecule antagonists of the melanocortin 4 receptor (MC4-R). Bioorg Med Chem Lett14:3721-5 (2004) 
 
Melanocortin receptor 4
Name:Melanocortin receptor 4
Type:Enzyme
Mol. Mass.:36949.50
Organism:Homo sapiens (Human)
Description:P32245
Residue:332
BDBM50148979
NameBDBM50148979
Synonyms:2-{2-[2-(5-Bromo-2-methoxy-phenyl)-ethyl]-3-chloro-phenyl}-1-sec-butyl-1H-imidazole | CHEMBL122382
TypeSmall organic molecule
Emp. Form.C22H24BrClN2O
Mol. Mass.447.796
SMILESCCC(C)n1ccnc1-c1cccc(Cl)c1CCc1cc(Br)ccc1OC