Reaction Details
TargetMelanocortin receptor 4
LigandBDBM50148974
Substrate/Competitorn/a
Meas. Tech.ChEBML_106507
Ki 180±n/a nM
Citation Marsilje, THRoses, JBCalderwood, EFStroud, SGForsyth, NEBlackburn, CYowe, DLMiao, WDrabic, SVBohane, MDScott Daniels, JLi, PWu, LPatane, MAClaiborne, CF Synthesis and biological evaluation of imidazole-based small molecule antagonists of the melanocortin 4 receptor (MC4-R). Bioorg Med Chem Lett14:3721-5 (2004) 
 
Melanocortin receptor 4
Name:Melanocortin receptor 4
Type:Enzyme
Mol. Mass.:36949.50
Organism:Homo sapiens (Human)
Description:P32245
Residue:332
BDBM50148974
NameBDBM50148974
Synonyms:3-{2-[2-(5-Bromo-2-methoxy-phenyl)-ethyl]-3-chloro-phenyl}-6,7-dihydro-5H-pyrrolo[1,2-c]imidazole | CHEMBL123263
TypeSmall organic molecule
Emp. Form.C21H20BrClN2O
Mol. Mass.431.753
SMILESCOc1ccc(Br)cc1CCc1c(Cl)cccc1-c1ncc2CCCn12