Reaction Details
TargetEstrogen receptor beta
LigandBDBM50149058
Substrate/Competitorn/a
Meas. Tech.ChEBML_67683
IC50 31±n/a nM
Citation Tan, QBirzin, ETChan, WTien Yang, YPai, LYHayes, ECDaSilva, CADiNinno, FRohrer, SPSchaeffer, JMHammond, ML Estrogen receptor ligands. Part 5: The SAR of dihydrobenzoxathiins containing modified basic side chains. Bioorg Med Chem Lett14:3747-51 (2004) 
 
Estrogen receptor beta
Name:Estrogen receptor beta
Type:Protein
Mol. Mass.:59238.43
Organism:Homo sapiens (Human)
Description:Q92731
Residue:530
BDBM50149058
NameBDBM50149058
Synonyms:(2S,3R)-3-(4-Hydroxy-phenyl)-2-[4-(1,2,3,6-tetrahydro-pyridin-4-yl)-phenyl]-2,3-dihydro-benzo[1,4]oxathiin-6-ol | CHEMBL334096
TypeSmall organic molecule
Emp. Form.C25H23NO3S
Mol. Mass.417.52
SMILESOc1ccc(cc1)[C@H]1Sc2cc(O)ccc2O[C@H]1c1ccc(cc1)C1=CCNCC1