Reaction Details
TargetEstrogen receptor
LigandBDBM50149060
Substrate/Competitorn/a
Meas. Tech.ChEBML_67367
IC50 0.700000±n/a nM
Citation Tan, QBirzin, ETChan, WTien Yang, YPai, LYHayes, ECDaSilva, CADiNinno, FRohrer, SPSchaeffer, JMHammond, ML Estrogen receptor ligands. Part 5: The SAR of dihydrobenzoxathiins containing modified basic side chains. Bioorg Med Chem Lett14:3747-51 (2004) 
 
Estrogen receptor
Name:Estrogen receptor
Type:Protein
Mol. Mass.:66230.44
Organism:Homo sapiens (Human)
Description:P03372
Residue:595
BDBM50149060
NameBDBM50149060
Synonyms:(2S,3R)-3-(4-Hydroxy-phenyl)-2-(3-piperidin-1-yl-propyl)-2,3-dihydro-benzo[1,4]oxathiin-6-ol | CHEMBL122208
TypeSmall organic molecule
Emp. Form.C22H27NO3S
Mol. Mass.385.52
SMILESOc1ccc(cc1)[C@H]1Sc2cc(O)ccc2O[C@H]1CCCN1CCCCC1