Reaction Details
TargetCoagulation factor X
LigandBDBM50149081
Substrate/Competitorn/a
Meas. Tech.ChEBML_48487
IC50 1100±n/a nM
Citation Mederski, WWDorsch, DAnzali, SGleitz, JCezanne, BTsaklakidis, C Halothiophene benzimidazoles as P1 surrogates of inhibitors of blood coagulation factor Xa. Bioorg Med Chem Lett14:3763-9 (2004) 
 
Coagulation factor X
Name:Coagulation factor X
Type:Enzyme
Mol. Mass.:54726.60
Organism:Homo sapiens (Human)
Description:n/a
Residue:488
BDBM50149081
NameBDBM50149081
Synonyms:6-[2-(5-Chloro-thiophen-2-yl)-1H-benzoimidazol-5-yl]-5-methyl-4,5-dihydro-2H-pyridazin-3-one | CHEMBL333113
TypeSmall organic molecule
Emp. Form.C16H13ClN4OS
Mol. Mass.344.819
SMILESCC1CC(=O)NN=C1c1ccc2nc([nH]c2c1)-c1ccc(Cl)s1