Reaction Details
TargetCoagulation factor X
LigandBDBM50149076
Substrate/Competitorn/a
Meas. Tech.ChEBML_48487
IC50 41±n/a nM
Citation Mederski, WWDorsch, DAnzali, SGleitz, JCezanne, BTsaklakidis, C Halothiophene benzimidazoles as P1 surrogates of inhibitors of blood coagulation factor Xa. Bioorg Med Chem Lett14:3763-9 (2004) 
 
Coagulation factor X
Name:Coagulation factor X
Type:Enzyme
Mol. Mass.:54726.60
Organism:Homo sapiens (Human)
Description:n/a
Residue:488
BDBM50149076
NameBDBM50149076
Synonyms:2-[2-(5-Bromo-thiophen-2-yl)-1H-benzoimidazol-5-yl]-N-[3-methyl-4-(3-oxo-morpholin-4-yl)-phenyl]-acetamide | CHEMBL420338
TypeSmall organic molecule
Emp. Form.C24H21BrN4O3S
Mol. Mass.525.418
SMILESCc1cc(NC(=O)Cc2ccc3nc([nH]c3c2)-c2ccc(Br)s2)ccc1N1CCOCC1=O