Reaction Details
TargetCoagulation factor X
LigandBDBM50149088
Substrate/Competitorn/a
Meas. Tech.ChEBML_48487
IC50 7.6±n/a nM
Citation Mederski, WWDorsch, DAnzali, SGleitz, JCezanne, BTsaklakidis, C Halothiophene benzimidazoles as P1 surrogates of inhibitors of blood coagulation factor Xa. Bioorg Med Chem Lett14:3763-9 (2004) 
 
Coagulation factor X
Name:Coagulation factor X
Type:Enzyme
Mol. Mass.:54726.60
Organism:Homo sapiens (Human)
Description:n/a
Residue:488
BDBM50149088
NameBDBM50149088
Synonyms:3-[2-(5-Chloro-thiophen-2-yl)-1H-benzoimidazol-5-yl]-N-[3-fluoro-4-(2-oxo-2H-pyridin-1-yl)-phenyl]-propionamide | CHEMBL122102
TypeSmall organic molecule
Emp. Form.C25H18ClFN4O2S
Mol. Mass.492.952
SMILESFc1cc(NC(=O)CCc2ccc3nc([nH]c3c2)-c2ccc(Cl)s2)ccc1-n1ccccc1=O