Reaction Details
TargetCoagulation factor X
LigandBDBM50149095
Substrate/Competitorn/a
Meas. Tech.ChEBML_48487
IC50 1200±n/a nM
Citation Mederski, WWDorsch, DAnzali, SGleitz, JCezanne, BTsaklakidis, C Halothiophene benzimidazoles as P1 surrogates of inhibitors of blood coagulation factor Xa. Bioorg Med Chem Lett14:3763-9 (2004) 
 
Coagulation factor X
Name:Coagulation factor X
Type:Enzyme
Mol. Mass.:54726.60
Organism:Homo sapiens (Human)
Description:n/a
Residue:488
BDBM50149095
NameBDBM50149095
Synonyms:CHEMBL124657 | N-[2-(5-Chloro-thiophen-2-yl)-1H-benzoimidazol-5-yl]-2-[4-(3-oxo-morpholin-4-yl)-phenyl]-acetamide
TypeSmall organic molecule
Emp. Form.C23H19ClN4O3S
Mol. Mass.466.94
SMILESClc1ccc(s1)-c1nc2ccc(NC(=O)Cc3ccc(cc3)N3CCOCC3=O)cc2[nH]1