Reaction Details
TargetCoagulation factor X
LigandBDBM50149098
Substrate/Competitorn/a
Meas. Tech.ChEBML_48487
IC50 7±n/a nM
Citation Mederski, WWDorsch, DAnzali, SGleitz, JCezanne, BTsaklakidis, C Halothiophene benzimidazoles as P1 surrogates of inhibitors of blood coagulation factor Xa. Bioorg Med Chem Lett14:3763-9 (2004) 
 
Coagulation factor X
Name:Coagulation factor X
Type:Enzyme
Mol. Mass.:54726.60
Organism:Homo sapiens (Human)
Description:n/a
Residue:488
BDBM50149098
NameBDBM50149098
Synonyms:CHEMBL125552 | N-[3-Chloro-4-(3-oxo-morpholin-4-yl)-phenyl]-3-[2-(5-chloro-thiophen-2-yl)-1H-benzoimidazol-5-yl]-propionamide
TypeSmall organic molecule
Emp. Form.C24H20Cl2N4O3S
Mol. Mass.515.412
SMILESClc1ccc(s1)-c1nc2ccc(CCC(=O)Nc3ccc(N4CCOCC4=O)c(Cl)c3)cc2[nH]1