Reaction Details
TargetProthrombin
LigandBDBM50149085
Substrate/Competitorn/a
Meas. Tech.ChEBML_207951
IC50>10000±n/a nM
Citation Mederski, WWDorsch, DAnzali, SGleitz, JCezanne, BTsaklakidis, C Halothiophene benzimidazoles as P1 surrogates of inhibitors of blood coagulation factor Xa. Bioorg Med Chem Lett14:3763-9 (2004) 
 
Prothrombin
Name:Prothrombin
Type:Protein
Mol. Mass.:70029.57
Organism:Homo sapiens (Human)
Description:P00734
Residue:622
BDBM50149085
NameBDBM50149085
Synonyms:2-[2-(5-Bromo-thiophen-2-yl)-1H-benzoimidazol-5-yl]-N-[4-(2-oxo-2H-pyridin-1-yl)-phenyl]-acetamide | CHEMBL419608
TypeSmall organic molecule
Emp. Form.C24H17BrN4O2S
Mol. Mass.505.386
SMILESBrc1ccc(s1)-c1nc2ccc(CC(=O)Nc3ccc(cc3)-n3ccccc3=O)cc2[nH]1