Reaction Details
TargetMu-type opioid receptor
LigandBDBM50149394
Substrate/Competitorn/a
Meas. Tech.ChEMBL_148857 (CHEMBL756653)
Ki 0.29±n/a nM
Citation Fujita, YTsuda, YLi, TMotoyama, TTakahashi, MShimizu, YYokoi, TSasaki, YAmbo, AKita, AJinsmaa, YBryant, SDLazarus, LHOkada, Y Development of potent bifunctional endomorphin-2 analogues with mixed mu-/delta-opioid agonist and delta-opioid antagonist properties. J Med Chem47:3591-9 (2004) 
 
Mu-type opioid receptor
Name:Mu-type opioid receptor
Type:G Protein-Coupled Receptor (GPCR)
Mol. Mass.:44503.11
Organism:Rattus norvegicus (rat)
Description:Competition binding assays were carried out using membrane preparations from transfected HN9.10 cells that constitutively expressed the mu opioid receptor.
Residue:398
BDBM50149394
NameBDBM50149394
Synonyms:1-[(S)-2-Amino-3-(4-hydroxy-2,6-dimethyl-phenyl)-propionyl]-pyrrolidine-2-carboxylic acid [1-((S)-naphthalen-1-ylcarbamoyl)-2-phenyl-ethyl]-amide | CHEMBL339417
TypeSmall organic molecule
Emp. Form.C35H38N4O4
Mol. Mass.578.7006
SMILESCc1cc(O)cc(C)c1C[C@H](N)C(=O)N1CCC[C@H]1C(=O)N[C@@H](Cc1ccccc1)C(=O)Nc1cccc2ccccc12