Reaction Details
TargetMu-type opioid receptor
LigandBDBM50149401
Substrate/Competitorn/a
Meas. Tech.ChEMBL_148857 (CHEMBL756653)
Ki 49±n/a nM
Citation Fujita, YTsuda, YLi, TMotoyama, TTakahashi, MShimizu, YYokoi, TSasaki, YAmbo, AKita, AJinsmaa, YBryant, SDLazarus, LHOkada, Y Development of potent bifunctional endomorphin-2 analogues with mixed mu-/delta-opioid agonist and delta-opioid antagonist properties. J Med Chem47:3591-9 (2004) 
 
Mu-type opioid receptor
Name:Mu-type opioid receptor
Type:G Protein-Coupled Receptor (GPCR)
Mol. Mass.:44503.11
Organism:Rattus norvegicus (rat)
Description:Competition binding assays were carried out using membrane preparations from transfected HN9.10 cells that constitutively expressed the mu opioid receptor.
Residue:398
BDBM50149401
NameBDBM50149401
Synonyms:1-[(S)-2-Amino-3-(4-hydroxy-phenyl)-propionyl]-pyrrolidine-2-carboxylic acid [2-phenyl-1-((S)-pyridin-3-ylcarbamoyl)-ethyl]-amide | CHEMBL332309
TypeSmall organic molecule
Emp. Form.C28H31N5O4
Mol. Mass.501.5768
SMILESN[C@@H](Cc1ccc(O)cc1)C(=O)N1CCC[C@H]1C(=O)N[C@@H](Cc1ccccc1)C(=O)Nc1cccnc1